Reaction Details
TargetChitin synthase 1
LigandBDBM50089553
Substrate/Competitorn/a
Meas. Tech.ChEBML_49240
IC50 391.0±n/a nM
Citation Masubuchi, KTaniguchi, MUmeda, IHattori, KSuda, HKohchi, YIsshiki, YSakai, TKohchi, MShirai, MOkabe, HSudoh, MYamazaki, TShimma, N Synthesis and structure-activity relationships of novel fungal chitin synthase inhibitors. Bioorg Med Chem Lett10:1459-62 (2000) Chitin synthase 1
Name:Chitin synthase 1
Type:PROTEIN
Mol. Mass.:88249.31
Organism:Candida albicans
Description:ChEMBL_49240
Residue:776
BDBM50089553
NameBDBM50089553
Synonyms:CHEMBL32687 | N-((E)-6,6-Dimethyl-hept-2-en-4-ynyl)-N-(2-oxo-1,2,3,4-tetrahydro-quinolin-5-yl)-methanesulfonamide
TypeSmall organic molecule
Emp. Form.C19H24N2O3S
Mol. Mass.360.47
SMILESCC(C)(C)C#C\C=C\CN(c1cccc2NC(=O)CCc12)S(C)(=O)=O