Reaction Details
TargetBifunctional purine biosynthesis protein ATIC
LigandBDBM50089572
Substrate/Competitorn/a
Meas. Tech.ChEBML_32812
Ki 17000±n/a nM
Citation Boger, DLMarsilje, THCastro, RAHedrick, MPJin, QBaker, SJShim, JHBenkovic, SJ Design, synthesis, and biological evaluation of fluoronitrophenyl substituted folate analogues as potential inhibitors of GAR transformylase and AICAR transformylase. Bioorg Med Chem Lett10:1471-5 (2000) Bifunctional purine biosynthesis protein ATIC
Name:Bifunctional purine biosynthesis protein ATIC
Type:Protein
Mol. Mass.:64616.62
Organism:Homo sapiens (Human)
Description:P31939
Residue:592
BDBM50089572
NameBDBM50089572
Synonyms:2-{4-[(2-Amino-4-oxo-3,4-dihydro-quinazolin-6-ylmethyl)-(4-fluoro-3-nitro-benzyl)-amino]-benzoylamino}-pentanedioic acid | CHEMBL286459
TypeSmall organic molecule
Emp. Form.C28H25FN6O8
Mol. Mass.592.5319
SMILESNc1nc2ccc(CN(Cc3ccc(F)c(c3)[N+]([O-])=O)c3ccc(cc3)C(=O)NC(CCC(O)=O)C(O)=O)cc2c(=O)[nH]1