Reaction Details
TargetMuscarinic acetylcholine receptor M2
LigandBDBM50004665
Substrate/Competitorn/a
Meas. Tech.ChEMBL_139771 (CHEMBL747481)
Ki 660±n/a nM
Citation Daly, JWGupta, THPadgett, WLPei, XF 6beta-Acyloxy(nor)tropanes: affinities for antagonist/agonist binding sites on transfected and native muscarinic receptors. J Med Chem43:2514-22 (2000) Muscarinic acetylcholine receptor M2
Name:Muscarinic acetylcholine receptor M2
Type:GPCR
Mol. Mass.:51730.61
Organism:Homo sapiens (Human)
Description:P08172
Residue:466
BDBM50004665
NameBDBM50004665
Synonyms:(oxotremorine)1-(4-Pyrrolidin-1-yl-but-2-ynyl)-pyrrolidin-2-one 1-(4-Pyrrolidin-1-yl-but-2-ynyl)-pyrrolidin-2-one (oxotremorphine) 1-[4-(2-oxo-pyrrolidin-1-yl)-but-2-ynyl]-pyrrolidinium Oxotremorine cid_4630
TypeSmall organic molecule
Emp. Form.C12H18N2O
Mol. Mass.206.2841
SMILESO=C1CCCN1CC#CCN1CCCC1