Reaction Details
TargetType-1 angiotensin II receptor
LigandBDBM50089990
Substrate/Competitorn/a
Meas. Tech.ChEMBL_36798 (CHEMBL650318)
Ki 25±n/a nM
Citation Le Bourdonnec, BMeulon, EYous, SGoossens, JFHoussin, RHénichart, JP Synthesis and pharmacological evaluation of new pyrazolidine-3, 5-diones as AT(1) angiotensin II receptor antagonists. J Med Chem43:2685-97 (2000) Type-1 angiotensin II receptor
Name:Type-1 angiotensin II receptor
Type:Protein
Mol. Mass.:41080.75
Organism:Homo sapiens (Human)
Description:P30556
Residue:359
BDBM50089990
NameBDBM50089990
Synonyms:2-Butyl-3-[2'-(1H-tetrazol-5-yl)-biphenyl-4-ylmethyl]-2,3-diaza-spiro[4.4]nonane-1,4-dione CHEMBL315444
TypeSmall organic molecule
Emp. Form.C25H28N6O2
Mol. Mass.444.5288
SMILESCCCCN1N(Cc2ccc(cc2)-c2ccccc2-c2nnn[nH]2)C(=O)C2(CCCC2)C1=O