Reaction Details
TargetAlpha-1A adrenergic receptor
LigandBDBM50090032
Substrate/Competitorn/a
Meas. Tech.ChEMBL_33604 (CHEMBL652812)
Ki 0.12±n/a nM
Citation Barrow, JCNantermet, PGSelnick, HGGlass, KLRittle, KEGilbert, KFSteele, TGHomnick, CFFreidinger, RMRansom, RWKling, PReiss, DBroten, TPSchorn, TWChang, RSO'Malley, SSOlah, TVEllis, JDBarrish, AKassahun, KLeppert, PNagarathnam, DForray, C In vitro and in vivo evaluation of dihydropyrimidinone C-5 amides as potent and selective alpha(1A) receptor antagonists for the treatment of benign prostatic hyperplasia. J Med Chem43:2703-18 (2000) Alpha-1A adrenergic receptor
Name:Alpha-1A adrenergic receptor
Type:Cell-surface receptors
Mol. Mass.:51511.67
Organism:Homo sapiens (Human)
Description:P35348
Residue:466
BDBM50090032
NameBDBM50090032
Synonyms:(R)-4-(3,4-Difluoro-phenyl)-1-methyl-2-oxo-1,2,3,4-tetrahydro-pyrimidine-5-carboxylic acid {3-[4-cyano-4-(4-fluoro-phenyl)-piperidin-1-yl]-propyl}-amide | CHEMBL91616
TypeSmall organic molecule
Emp. Form.C27H28F3N5O2
Mol. Mass.511.5387
SMILESCN1C=C([C@H](NC1=O)c1ccc(F)c(F)c1)C(=O)NCCCN1CCC(CC1)(C#N)c1ccc(F)cc1