Reaction Details
TargetAlpha-1B adrenergic receptor
LigandBDBM50090041
Substrate/Competitorn/a
Meas. Tech.ChEMBL_34456 (CHEMBL651988)
Ki 25±n/a nM
Citation Barrow, JCNantermet, PGSelnick, HGGlass, KLRittle, KEGilbert, KFSteele, TGHomnick, CFFreidinger, RMRansom, RWKling, PReiss, DBroten, TPSchorn, TWChang, RSO'Malley, SSOlah, TVEllis, JDBarrish, AKassahun, KLeppert, PNagarathnam, DForray, C In vitro and in vivo evaluation of dihydropyrimidinone C-5 amides as potent and selective alpha(1A) receptor antagonists for the treatment of benign prostatic hyperplasia. J Med Chem43:2703-18 (2000) Alpha-1B adrenergic receptor
Name:Alpha-1B adrenergic receptor
Type:Enzyme
Mol. Mass.:56862.13
Organism:Homo sapiens (Human)
Description:P35368
Residue:520
BDBM50090041
NameBDBM50090041
Synonyms:6-(3,4-Difluoro-phenyl)-5-{3-[4-(4-fluoro-phenyl)-piperidin-1-yl]-propylcarbamoyl}-3,4-dimethyl-2-oxo-3,6-dihydro-2H-pyrimidine-1-carboxylic acid methyl ester | CHEMBL93623
TypeSmall organic molecule
Emp. Form.C29H33F3N4O4
Mol. Mass.558.5919
SMILESCOC(=O)N1[C@@H](C(C(=O)NCCCN2CCC(CC2)c2ccc(F)cc2)=C(C)N(C)C1=O)c1ccc(F)c(F)c1