Reaction Details
TargetAlpha-1B adrenergic receptor
LigandBDBM50090012
Substrate/Competitorn/a
Meas. Tech.ChEMBL_34456 (CHEMBL651988)
Ki 72±n/a nM
Citation Barrow, JCNantermet, PGSelnick, HGGlass, KLRittle, KEGilbert, KFSteele, TGHomnick, CFFreidinger, RMRansom, RWKling, PReiss, DBroten, TPSchorn, TWChang, RSO'Malley, SSOlah, TVEllis, JDBarrish, AKassahun, KLeppert, PNagarathnam, DForray, C In vitro and in vivo evaluation of dihydropyrimidinone C-5 amides as potent and selective alpha(1A) receptor antagonists for the treatment of benign prostatic hyperplasia. J Med Chem43:2703-18 (2000) Alpha-1B adrenergic receptor
Name:Alpha-1B adrenergic receptor
Type:Enzyme
Mol. Mass.:56862.13
Organism:Homo sapiens (Human)
Description:P35368
Residue:520
BDBM50090012
NameBDBM50090012
Synonyms:4-(3,4-Difluoro-phenyl)-1,3-dimethyl-2-oxo-1,2,3,4-tetrahydro-pyrimidine-5-carboxylic acid {3-[4-cyano-4-(2-cyano-4-fluoro-phenyl)-piperidin-1-yl]-propyl}-amide | CHEMBL93843
TypeSmall organic molecule
Emp. Form.C29H29F3N6O2
Mol. Mass.550.5748
SMILESCN1C=C([C@H](N(C)C1=O)c1ccc(F)c(F)c1)C(=O)NCCCN1CCC(CC1)(C#N)c1ccc(F)cc1C#N