Reaction Details
TargetKappa-type opioid receptor
LigandBDBM50090100
Substrate/Competitorn/a
Meas. Tech.ChEMBL_145814 (CHEMBL753526)
Ki 0.244±n/a nM
Citation Stevens, WCJones, RMSubramanian, GMetzger, TGFerguson, DMPortoghese, PS Potent and selective indolomorphinan antagonists of the kappa-opioid receptor. J Med Chem43:2759-69 (2000) Kappa-type opioid receptor
Name:Kappa-type opioid receptor
Type:G Protein-Coupled Receptor (GPCR)
Mol. Mass.:42692.90
Organism:Rattus norvegicus (rat)
Description:P34975
Residue:380
BDBM50090100
NameBDBM50090100
Synonyms:CHEMBL319202 | Norbinaltorphimine (norBNI)
TypeSmall organic molecule
Emp. Form.C40H43N3O6
Mol. Mass.661.7859
SMILESOc1ccc2CC3N(CC4CC4)CC[C@@]45C(Oc1c24)c1[nH]c2CC4(O)[C@H]6Cc7ccc(O)c8OC(c2c1CC35O)C4(CCN6CC1CC1)c78