Reaction Details
TargetIntegrin alpha-4/beta-7
LigandBDBM50090119
Substrate/Competitorn/a
Meas. Tech.ChEMBL_35461 (CHEMBL643891)
IC50 9000±n/a nM
Citation Harriman, GCSchwender, CFGallant, DCochran, NABriskin, MJ Cell adhesion antagonists: synthesis and evaluation of a novel series of phenylalanine based inhibitors. Bioorg Med Chem Lett10:1497-9 (2000) Integrin alpha-4/beta-7
Name:Integrin alpha-4/beta-7
Type:Protein Complex
Mol. Mass.:n/a
Description:The assay uses stably transfected K562 cells expressing human alpha4beta7 integrin.
Components:This complex has 2 components.
Component 1
Name:Integrin alpha-4
Synonyms:CD49 antigen-like family member D CD49d antigen ITA4_HUMAN Integrin alpha-4 Integrin alpha-IV VLA-4 integrin alpha 4 precursor | integrin alpha-4 precursor
Type:Membrane Protein
Mol. Mass.:114897.35
Organism:Homo sapiens (Human)
Description:P13612
Residue:1032
Component 2
Name:Integrin beta-7
Synonyms:ITB7_HUMAN Integrin alpha-4/beta-7 Integrin beta7
Type:Membrane Protein
Mol. Mass.:86893.88
Organism:Homo sapiens (Human)
Description:P26010
Residue:798
BDBM50090119
NameBDBM50090119
Synonyms:(S)-2-(2-Hydroxy-5-nitro-benzylamino)-3-phenyl-propionic acid 2,2-dimethyl-propyl ester | CHEMBL37579
TypeSmall organic molecule
Emp. Form.C21H26N2O5
Mol. Mass.386.4415
SMILESCC(C)(C)COC(=O)[C@H](Cc1ccccc1)NCc1cc(ccc1O)[N+]([O-])=O