Reaction Details
TargetThromboxane A2 receptor
LigandBDBM50085910
Substrate/Competitorn/a
Meas. Tech.ChEMBL_210126 (CHEMBL814442)
EC50 2400±n/a nM
Citation deLong, MAAmburgey, JTaylor, CWos, JASoper, DLWang, YHicks, R Synthesis and in vitro evaluation of human FP-receptor selective prostaglandin analogues. Bioorg Med Chem Lett10:1519-22 (2000) Thromboxane A2 receptor
Name:Thromboxane A2 receptor
Type:Enyzme
Mol. Mass.:37445.28
Organism:Homo sapiens (Human)
Description:P21731
Residue:343
BDBM50085910
NameBDBM50085910
Synonyms:(Z)-7-{(1R,2R,3R,5S)-2-[(E)-(R)-4-(3-Chloro-phenoxy)-3-hydroxy-but-1-enyl]-3,5-dihydroxy-cyclopentyl}-hept-5-enoic acid CHEMBL37853 | CLOPROSTENOL
TypeSmall organic molecule
Emp. Form.C22H29ClO6
Mol. Mass.424.915
SMILESO[C@@H](COc1cccc(Cl)c1)\C=C\[C@H]1[C@H](O)C[C@H](O)[C@@H]1C\C=C/CCCC(O)=O