Reaction Details
TargetProthrombin
LigandBDBM50090250
Substrate/Competitorn/a
Meas. Tech.ChEBML_208895
Ki 34±n/a nM
Citation Hayler, JKane, PDLeGrand, DLugrin, FMenear, KPrice, RAllen, MCockcroft, XAmbler, JButler, KDunnet, KMitchelson, ATalbot, MTweed, MWills, N The design and synthesis of thrombin inhibitors: the introduction of in vivo efficacy and oral bioavailability into benzthiazolylalanine inhibitors. Bioorg Med Chem Lett10:1567-70 (2000) Prothrombin
Name:Prothrombin
Type:Protein
Mol. Mass.:70029.57
Organism:Homo sapiens (Human)
Description:P00734
Residue:622
BDBM50090250
NameBDBM50090250
Synonyms:3-(8-{(S)-1-Benzothiazol-2-ylmethyl-2-[4-(2-fluoro-ethyl)-piperidin-1-yl]-2-oxo-ethylsulfamoyl}-3,3-dimethyl-1,2,3,4-tetrahydro-quinolin-6-yl)-N,N-dimethyl-propionamide | CHEMBL288920
TypeSmall organic molecule
Emp. Form.C33H44FN5O4S2
Mol. Mass.657.862
SMILESCN(C)C(=O)CCc1cc2CC(C)(C)CNc2c(c1)S(=O)(=O)N[C@@H](Cc1nc2ccccc2s1)C(=O)N1CCC(CCF)CC1