Reaction Details
TargetAlpha-1A adrenergic receptor
LigandBDBM50090303
Substrate/Competitorn/a
Meas. Tech.ChEBML_33730
Ki 7.5±n/a nM
Citation Patane, MADiPardo, RMNewton, RCPrice, RPBroten, TPChang, RSRansom, RWDi Salvo, JNagarathnam, DForray, CGluchowski, CBock, MG Phenylacetamides as selective alpha-1A adrenergic receptor antagonists. Bioorg Med Chem Lett10:1621-4 (2000) Alpha-1A adrenergic receptor
Name:Alpha-1A adrenergic receptor
Type:Cell-surface receptors
Mol. Mass.:51511.67
Organism:Homo sapiens (Human)
Description:P35348
Residue:466
BDBM50090303
NameBDBM50090303
Synonyms:CHEMBL42220 | N-{3-[4-Cyano-4-(2-methoxy-phenyl)-piperidin-1-yl]-propyl}-2,2-di-p-tolyl-acetamide
TypeSmall organic molecule
Emp. Form.C32H37N3O2
Mol. Mass.495.6551
SMILESCOc1ccccc1C1(CCN(CCCNC(=O)C(c2ccc(C)cc2)c2ccc(C)cc2)CC1)C#N