Reaction Details
TargetAlpha-1A adrenergic receptor
LigandBDBM50090307
Substrate/Competitorn/a
Meas. Tech.ChEBML_33730
Ki 1.3±n/a nM
Citation Patane, MADiPardo, RMNewton, RCPrice, RPBroten, TPChang, RSRansom, RWDi Salvo, JNagarathnam, DForray, CGluchowski, CBock, MG Phenylacetamides as selective alpha-1A adrenergic receptor antagonists. Bioorg Med Chem Lett10:1621-4 (2000) Alpha-1A adrenergic receptor
Name:Alpha-1A adrenergic receptor
Type:Cell-surface receptors
Mol. Mass.:51511.67
Organism:Homo sapiens (Human)
Description:P35348
Residue:466
BDBM50090307
NameBDBM50090307
Synonyms:CHEMBL298058 | N-[3-(4-Cyano-4-o-tolyl-piperidin-1-yl)-propyl]-2,2-di-p-tolyl-acetamide
TypeSmall organic molecule
Emp. Form.C32H37N3O
Mol. Mass.479.6557
SMILESCc1ccc(cc1)C(C(=O)NCCCN1CCC(CC1)(C#N)c1ccccc1C)c1ccc(C)cc1