Reaction Details
TargetAlpha-1A adrenergic receptor
LigandBDBM50090306
Substrate/Competitorn/a
Meas. Tech.ChEBML_33730
Ki 1.1±n/a nM
Citation Patane, MADiPardo, RMNewton, RCPrice, RPBroten, TPChang, RSRansom, RWDi Salvo, JNagarathnam, DForray, CGluchowski, CBock, MG Phenylacetamides as selective alpha-1A adrenergic receptor antagonists. Bioorg Med Chem Lett10:1621-4 (2000) Alpha-1A adrenergic receptor
Name:Alpha-1A adrenergic receptor
Type:Cell-surface receptors
Mol. Mass.:51511.67
Organism:Homo sapiens (Human)
Description:P35348
Residue:466
BDBM50090306
NameBDBM50090306
Synonyms:2,2-Di-p-tolyl-N-[3-(4-o-tolyl-piperazin-1-yl)-propyl]-acetamide | CHEMBL415887
TypeSmall organic molecule
Emp. Form.C30H37N3O
Mol. Mass.455.6343
SMILESCc1ccc(cc1)C(C(=O)NCCCN1CCN(CC1)c1ccccc1C)c1ccc(C)cc1