Reaction Details
TargetAlpha-1A adrenergic receptor
LigandBDBM50090324
Substrate/Competitorn/a
Meas. Tech.ChEBML_33730
Ki 24±n/a nM
Citation Patane, MADiPardo, RMNewton, RCPrice, RPBroten, TPChang, RSRansom, RWDi Salvo, JNagarathnam, DForray, CGluchowski, CBock, MG Phenylacetamides as selective alpha-1A adrenergic receptor antagonists. Bioorg Med Chem Lett10:1621-4 (2000) Alpha-1A adrenergic receptor
Name:Alpha-1A adrenergic receptor
Type:Cell-surface receptors
Mol. Mass.:51511.67
Organism:Homo sapiens (Human)
Description:P35348
Residue:466
BDBM50090324
NameBDBM50090324
Synonyms:CHEMBL417350 | N-[3-(4-Cyano-4-o-tolyl-piperidin-1-yl)-propyl]-2-(4-fluoro-phenyl)-3-methyl-butyramide
TypeSmall organic molecule
Emp. Form.C27H34FN3O
Mol. Mass.435.5768
SMILESCC(C)C(C(=O)NCCCN1CCC(CC1)(C#N)c1ccccc1C)c1ccc(F)cc1