Reaction Details
TargetAlpha-1A adrenergic receptor
LigandBDBM50090316
Substrate/Competitorn/a
Meas. Tech.ChEBML_33730
Ki 6.4±n/a nM
Citation Patane, MADiPardo, RMNewton, RCPrice, RPBroten, TPChang, RSRansom, RWDi Salvo, JNagarathnam, DForray, CGluchowski, CBock, MG Phenylacetamides as selective alpha-1A adrenergic receptor antagonists. Bioorg Med Chem Lett10:1621-4 (2000) Alpha-1A adrenergic receptor
Name:Alpha-1A adrenergic receptor
Type:Cell-surface receptors
Mol. Mass.:51511.67
Organism:Homo sapiens (Human)
Description:P35348
Residue:466
BDBM50090316
NameBDBM50090316
Synonyms:2-(4-Chloro-phenyl)-N-[3-(4-cyano-4-o-tolyl-piperidin-1-yl)-propyl]-3-methyl-butyramide | CHEMBL289339
TypeSmall organic molecule
Emp. Form.C27H34ClN3O
Mol. Mass.452.031
SMILESCC(C)C(C(=O)NCCCN1CCC(CC1)(C#N)c1ccccc1C)c1ccc(Cl)cc1