Reaction Details
TargetAlpha-1A adrenergic receptor
LigandBDBM50090331
Substrate/Competitorn/a
Meas. Tech.ChEBML_34181
Ki 0.700000±n/a nM
Citation Nantermet, PGBarrow, JCSelnick, HGHomnick, CFFreidinger, RMChang, RSO'Malley, SSReiss, DRBroten, TPRansom, RWPettibone, DJOlah, TForray, C Selective alpha1a adrenergic receptor antagonists based on 4-aryl-3,4-dihydropyridine-2-ones. Bioorg Med Chem Lett10:1625-8 (2000) Alpha-1A adrenergic receptor
Name:Alpha-1A adrenergic receptor
Type:Cell-surface receptors
Mol. Mass.:51511.67
Organism:Homo sapiens (Human)
Description:P35348
Residue:466
BDBM50090331
NameBDBM50090331
Synonyms:(R)-4-(3,4-Difluoro-phenyl)-1,2-dimethyl-6-oxo-1,4,5,6-tetrahydro-pyridine-3-carboxylic acid {3-[4-(4-fluoro-phenyl)-piperidin-1-yl]-propyl}-amide | CHEMBL287791
TypeSmall organic molecule
Emp. Form.C28H32F3N3O2
Mol. Mass.499.5678
SMILESCN1C(=O)C[C@@H](C(C(=O)NCCCN2CCC(CC2)c2ccc(F)cc2)=C1C)c1ccc(F)c(F)c1