Reaction Details
Target72 kDa type IV collagenase
LigandBDBM50090372
Substrate/Competitorn/a
Meas. Tech.ChEMBL_104541 (CHEMBL718928)
Ki 8±n/a nM
Citation Salvino, JMMathew, RKiesow, TNarensingh, RMason, HJDodd, AGroneberg, RBurns, CJMcGeehan, GKline, JOrton, ETang, SYMorrisette, MLabaudininiere, R Solid-phase synthesis of an arylsulfone hydroxamate library. Bioorg Med Chem Lett10:1637-40 (2000) 72 kDa type IV collagenase
Name:72 kDa type IV collagenase
Type:Enzyme
Mol. Mass.:73870.36
Organism:Homo sapiens (Human)
Description: P08253
Residue:660
BDBM50090372
NameBDBM50090372
Synonyms:3-(4-Methoxy-benzenesulfonyl)-4-phenyl-pentanoic acid hydroxyamide | CHEMBL43667
TypeSmall organic molecule
Emp. Form.C18H21NO5S
Mol. Mass.363.428
SMILESCOc1ccc(cc1)S(=O)(=O)C(CC(=O)NO)C(C)c1ccccc1