Reaction Details
TargetSodium-dependent dopamine transporter
LigandBDBM50090489
Substrate/Competitorn/a
Meas. Tech.ChEBML_62646
Ki 21490±n/a nM
Citation Kawai, HKotake, YOhta, S Inhibition of dopamine receptors by endogenous amines: binding to striatal receptors and pharmacological effects on locomotor activity. Bioorg Med Chem Lett10:1669-71 (2000) Sodium-dependent dopamine transporter
Name:Sodium-dependent dopamine transporter
Type:Multi-pass membrane protein
Mol. Mass.:68749.45
Organism:Rattus norvegicus (rat)
Description:P23977
Residue:619
BDBM50090489
NameBDBM50090489
Synonyms:4-(1,2,3,4-Tetrahydro-isoquinolin-1-ylmethyl)-benzene-1,2-diol | CHEMBL44877
TypeSmall organic molecule
Emp. Form.C16H17NO2
Mol. Mass.255.3117
SMILESOc1ccc(CC2NCCc3ccccc23)cc1O