Reaction Details
TargetSodium-dependent dopamine transporter
LigandBDBM50090488
Substrate/Competitorn/a
Meas. Tech.ChEBML_62646
Ki 57550±n/a nM
Citation Kawai, HKotake, YOhta, S Inhibition of dopamine receptors by endogenous amines: binding to striatal receptors and pharmacological effects on locomotor activity. Bioorg Med Chem Lett10:1669-71 (2000) Sodium-dependent dopamine transporter
Name:Sodium-dependent dopamine transporter
Type:Multi-pass membrane protein
Mol. Mass.:68749.45
Organism:Rattus norvegicus (rat)
Description:P23977
Residue:619
BDBM50090488
NameBDBM50090488
Synonyms:1-Benzyl-1,2,3,4-tetrahydro-isoquinoline-6,7-diol | CHEMBL298285
TypeSmall organic molecule
Emp. Form.C16H17NO2
Mol. Mass.255.3117
SMILESOc1cc2CCNC(Cc3ccccc3)c2cc1O