Reaction Details
Target5-hydroxytryptamine receptor 1D
LigandBDBM50090519
Substrate/Competitorn/a
Meas. Tech.ChEBML_1730
Ki 0.400000±n/a nM
Citation Slassi, AEdwards, LO'Brien, AMeng, CQXin, TSeto, CLee, DKMacLean, NHynd, DChen, CWang, HKamboj, RRakhit, S 5-Alkyltryptamine derivatives as highly selective and potent 5-HT1D receptor agonists. Bioorg Med Chem Lett10:1707-9 (2000) 5-hydroxytryptamine receptor 1D
Name:5-hydroxytryptamine receptor 1D
Type:G Protein-Coupled Receptor (GPCR)
Mol. Mass.:41920.63
Organism:Homo sapiens (Human)
Description:Receptor binding assays were performed using human clone stably expressed in CHO cells.
Residue:377
BDBM50090519
NameBDBM50090519
Synonyms:CHEMBL300519 | [2-(5-Isopropyl-1H-indol-3-yl)-ethyl]-dimethyl-amine
TypeSmall organic molecule
Emp. Form.C15H22N2
Mol. Mass.230.3486
SMILESCC(C)c1ccc2[nH]cc(CCN(C)C)c2c1