Reaction Details
Target5-hydroxytryptamine receptor 1D
LigandBDBM50090521
Substrate/Competitorn/a
Meas. Tech.ChEBML_1730
Ki 2.5±n/a nM
Citation Slassi, AEdwards, LO'Brien, AMeng, CQXin, TSeto, CLee, DKMacLean, NHynd, DChen, CWang, HKamboj, RRakhit, S 5-Alkyltryptamine derivatives as highly selective and potent 5-HT1D receptor agonists. Bioorg Med Chem Lett10:1707-9 (2000) 5-hydroxytryptamine receptor 1D
Name:5-hydroxytryptamine receptor 1D
Type:G Protein-Coupled Receptor (GPCR)
Mol. Mass.:41920.63
Organism:Homo sapiens (Human)
Description:Receptor binding assays were performed using human clone stably expressed in CHO cells.
Residue:377
BDBM50090521
NameBDBM50090521
Synonyms:5-tert-Butyl-3-(2-pyrrolidin-1-yl-ethyl)-1H-indole | CHEMBL297471
TypeSmall organic molecule
Emp. Form.C18H26N2
Mol. Mass.270.4124
SMILESCC(C)(C)c1ccc2[nH]cc(CCN3CCCC3)c2c1