Reaction Details
Target5-hydroxytryptamine receptor 1B
LigandBDBM50049099
Substrate/Competitorn/a
Meas. Tech.ChEBML_1359
Ki 286±n/a nM
Citation Slassi, AEdwards, LO'Brien, AMeng, CQXin, TSeto, CLee, DKMacLean, NHynd, DChen, CWang, HKamboj, RRakhit, S 5-Alkyltryptamine derivatives as highly selective and potent 5-HT1D receptor agonists. Bioorg Med Chem Lett10:1707-9 (2000) 5-hydroxytryptamine receptor 1B
Name:5-hydroxytryptamine receptor 1B
Type:G Protein-Coupled Receptor (GPCR)
Mol. Mass.:43579.17
Organism:Homo sapiens (Human)
Description:Receptor binding assays were performed using human clone stably expressed in CHO cells
Residue:390
BDBM50049099
NameBDBM50049099
Synonyms:CHEMBL50492 | [2-(5-Ethyl-1H-indol-3-yl)-ethyl]-dimethyl-amine
TypeSmall organic molecule
Emp. Form.C14H20N2
Mol. Mass.216.322
SMILESCCc1ccc2[nH]cc(CCN(C)C)c2c1