Reaction Details
Target5-hydroxytryptamine receptor 6
LigandBDBM28583
Substrate/Competitorn/a
Meas. Tech.ChEBML_3623
Ki 1.3±n/a nM
Citation Isaac, MSlassi, AXin, TMacLean, NWilson, JMcCallum, KWang, HDemchyshyn, L 6-Bicyclopiperazinyl-1-arylsulfonylindoles and 6-bicyclopiperidinyl-1-arylsulfonylindoles derivatives as novel, potent, and selective 5-HT6 receptor antagonists. Bioorg Med Chem Lett10:1719-21 (2000) 5-hydroxytryptamine receptor 6
Name:5-hydroxytryptamine receptor 6
Type:G Protein-Coupled Receptor (GPCR)
Mol. Mass.:46968.43
Organism:Homo sapiens (Human)
Description:P50406
Residue:440
BDBM28583
NameBDBM28583
Synonyms:5-chloro-N-[4-methoxy-3-(piperazin-1-yl)phenyl]-3-methyl-1-benzothiophene-2-sulfonamide hydrochloride SB 271046 | SB-271046
TypeSmall organic molecule
Emp. Form.C20H22ClN3O3S2
Mol. Mass.451.99
SMILESCOc1ccc(NS(=O)(=O)c2sc3ccc(Cl)cc3c2C)cc1N1CCNCC1