Reaction Details
Target5-hydroxytryptamine receptor 6
LigandBDBM50090529
Substrate/Competitorn/a
Meas. Tech.ChEBML_3623
Ki 0.200000±n/a nM
Citation Isaac, MSlassi, AXin, TMacLean, NWilson, JMcCallum, KWang, HDemchyshyn, L 6-Bicyclopiperazinyl-1-arylsulfonylindoles and 6-bicyclopiperidinyl-1-arylsulfonylindoles derivatives as novel, potent, and selective 5-HT6 receptor antagonists. Bioorg Med Chem Lett10:1719-21 (2000) 5-hydroxytryptamine receptor 6
Name:5-hydroxytryptamine receptor 6
Type:G Protein-Coupled Receptor (GPCR)
Mol. Mass.:46968.43
Organism:Homo sapiens (Human)
Description:P50406
Residue:440
BDBM50090529
NameBDBM50090529
Synonyms:2-[1-(Naphthalene-1-sulfonyl)-1H-indol-6-yl]-octahydro-pyrrolo[1,2-a]pyrazine | CHEMBL46187
TypeSmall organic molecule
Emp. Form.C25H25N3O2S
Mol. Mass.431.55
SMILESO=S(=O)(c1cccc2ccccc12)n1ccc2ccc(cc12)N1CCN2CCCC2C1