Reaction Details
TargetCoagulation factor X
LigandBDBM50090594
Substrate/Competitorn/a
Meas. Tech.ChEBML_48997
Ki 340±n/a nM
Citation He, WHanney, BMyers, MRSpada, APBrown, KColussi, DChu, V Nonbenzamidine compounds as selective factor Xa inhibitors. Bioorg Med Chem Lett10:1737-9 (2000) Coagulation factor X
Name:Coagulation factor X
Type:Enzyme
Mol. Mass.:54726.60
Organism:Homo sapiens (Human)
Description:n/a
Residue:488
BDBM50090594
NameBDBM50090594
Synonyms:2-[4-(6-Chloro-benzo[b]thiophene-2-sulfonyl)-2-oxo-piperazin-1-yl]-N-[2-(5-methyl-3H-imidazol-4-yl)-ethyl]-acetamide | CHEMBL46041
TypeSmall organic molecule
Emp. Form.C20H22ClN5O4S2
Mol. Mass.496.003
SMILESCc1nc[nH]c1CCNC(=O)CN1CCN(CC1=O)S(=O)(=O)c1cc2ccc(Cl)cc2s1