Reaction Details
TargetCoagulation factor X
LigandBDBM50090596
Substrate/Competitorn/a
Meas. Tech.ChEBML_48997
Ki 170±n/a nM
Citation He, WHanney, BMyers, MRSpada, APBrown, KColussi, DChu, V Nonbenzamidine compounds as selective factor Xa inhibitors. Bioorg Med Chem Lett10:1737-9 (2000) Coagulation factor X
Name:Coagulation factor X
Type:Enzyme
Mol. Mass.:54726.60
Organism:Homo sapiens (Human)
Description:n/a
Residue:488
BDBM50090596
NameBDBM50090596
Synonyms:2-[4-(6-Chloro-benzo[b]thiophene-2-sulfonyl)-2-oxo-piperazin-1-yl]-N-pyridin-4-yl-acetamide | CHEMBL45585
TypeSmall organic molecule
Emp. Form.C19H17ClN4O4S2
Mol. Mass.464.946
SMILESClc1ccc2cc(sc2c1)S(=O)(=O)N1CCN(CC(=O)Nc2ccncc2)C(=O)C1