Reaction Details
TargetCoagulation factor X
LigandBDBM50090607
Substrate/Competitorn/a
Meas. Tech.ChEBML_48997
Ki>1200±n/a nM
Citation He, WHanney, BMyers, MRSpada, APBrown, KColussi, DChu, V Nonbenzamidine compounds as selective factor Xa inhibitors. Bioorg Med Chem Lett10:1737-9 (2000) Coagulation factor X
Name:Coagulation factor X
Type:Enzyme
Mol. Mass.:54726.60
Organism:Homo sapiens (Human)
Description:n/a
Residue:488
BDBM50090607
NameBDBM50090607
Synonyms:2-[4-(6-Chloro-benzo[b]thiophene-2-sulfonyl)-2-oxo-piperazin-1-yl]-N-methyl-N-pyridin-4-yl-acetamide | CHEMBL45839
TypeSmall organic molecule
Emp. Form.C20H19ClN4O4S2
Mol. Mass.478.972
SMILESCN(C(=O)CN1CCN(CC1=O)S(=O)(=O)c1cc2ccc(Cl)cc2s1)c1ccncc1