Reaction Details
TargetCoagulation factor X
LigandBDBM12594
Substrate/Competitorn/a
Meas. Tech.ChEBML_48997
Ki 1.3±n/a nM
Citation He, WHanney, BMyers, MRSpada, APBrown, KColussi, DChu, V Nonbenzamidine compounds as selective factor Xa inhibitors. Bioorg Med Chem Lett10:1737-9 (2000) Coagulation factor X
Name:Coagulation factor X
Type:Enzyme
Mol. Mass.:54726.60
Organism:Homo sapiens (Human)
Description:n/a
Residue:488
BDBM12594
NameBDBM12594
Synonyms:4-({4-[(6-CHLORO-1-BENZOTHIEN-2-YL)SULFONYL]-2-OXOPIPERAZIN-1-YL}METHYL)BENZENECARBOXIMIDAMIDE CHEMBL48813 RPR200095
TypeSmall organic molecule
Emp. Form.C20H19ClN4O3S2
Mol. Mass.462.973
SMILESNC(=N)c1ccc(CN2CCN(CC2=O)S(=O)(=O)c2cc3ccc(Cl)cc3s2)cc1