Reaction Details
TargetProthrombin
LigandBDBM50090592
Substrate/Competitorn/a
Meas. Tech.ChEBML_208897
Ki>4000±n/a nM
Citation He, WHanney, BMyers, MRSpada, APBrown, KColussi, DChu, V Nonbenzamidine compounds as selective factor Xa inhibitors. Bioorg Med Chem Lett10:1737-9 (2000) Prothrombin
Name:Prothrombin
Type:Protein
Mol. Mass.:70029.57
Organism:Homo sapiens (Human)
Description:P00734
Residue:622
BDBM50090592
NameBDBM50090592
Synonyms:2-[4-(6-Chloro-benzo[b]thiophene-2-sulfonyl)-2-oxo-piperazin-1-yl]-N-[2-(3H-imidazol-4-yl)-ethyl]-acetamide | CHEMBL49510
TypeSmall organic molecule
Emp. Form.C19H20ClN5O4S2
Mol. Mass.481.976
SMILESClc1ccc2cc(sc2c1)S(=O)(=O)N1CCN(CC(=O)NCCc2cnc[nH]2)C(=O)C1