Reaction Details
TargetProstaglandin G/H synthase 1
LigandBDBM17638
Substrate/Competitorn/a
Meas. Tech.ChEBML_158586
IC50 190±n/a nM
Citation Bosch, JRoca, TCatena, JLLlorens, OPérez, JJLagunas, CFernández, AGMiquel, IFernández-Serrat, AFarrerons, C Synthesis and biological evaluation of 1,3,4-triaryl-3-pyrrolin-2-ones, a new class of selective cyclooxygenase-2 inhibitors. Bioorg Med Chem Lett10:1745-8 (2000) Prostaglandin G/H synthase 1
Name:Prostaglandin G/H synthase 1
Type:Enzyme
Mol. Mass.:68692.62
Organism:Homo sapiens (Human)
Description:P23219
Residue:599
BDBM17638
NameBDBM17638
Synonyms:2-{1-[(4-chlorophenyl)carbonyl]-5-methoxy-2-methyl-1H-indol-3-yl}acetic acid Indocin US11478464, Compound Indomethacin US9271961, Indomethacin | indometacin
TypeSmall organic molecule
Emp. Form.C19H16ClNO4
Mol. Mass.357.788
SMILESCOc1ccc2n(C(=O)c3ccc(Cl)cc3)c(C)c(CC(O)=O)c2c1