Reaction Details
TargetCytochrome P450 2C9
LigandBDBM50090679
Substrate/Competitorn/a
Meas. Tech.ChEMBL_51551 (CHEMBL840930)
Ki 2000±n/a nM
Citation Rao, SAoyama, RSchrag, MTrager, WFRettie, AJones, JP A refined 3-dimensional QSAR of cytochrome P450 2C9: computational predictions of drug interactions. J Med Chem43:2789-96 (2000) Cytochrome P450 2C9
Name:Cytochrome P450 2C9
Type:Enzyme
Mol. Mass.:55636.33
Organism:Homo sapiens (Human)
Description:P11712
Residue:490
BDBM50090679
NameBDBM50090679
Synonyms:2-(2-(2,5-dichlorophenylamino)phenyl)acetic acid [2-(2,5-Dichloro-phenylamino)-phenyl]-acetic acid
TypeSmall organic molecule
Emp. Form.C14H11Cl2NO2
Mol. Mass.296.149
SMILESOC(=O)Cc1ccccc1Nc1cc(Cl)ccc1Cl