Reaction Details
TargetCytochrome P450 2C9
LigandBDBM50408935
Substrate/Competitorn/a
Meas. Tech.ChEMBL_51549 (CHEMBL661223)
Ki 500±n/a nM
Citation Rao, SAoyama, RSchrag, MTrager, WFRettie, AJones, JP A refined 3-dimensional QSAR of cytochrome P450 2C9: computational predictions of drug interactions. J Med Chem43:2789-96 (2000) Cytochrome P450 2C9
Name:Cytochrome P450 2C9
Type:Enzyme
Mol. Mass.:55636.33
Organism:Homo sapiens (Human)
Description:P11712
Residue:490
BDBM50408935
NameBDBM50408935
Synonyms:CHEMBL2079628
TypeSmall organic molecule
Emp. Form.C18H16O3
Mol. Mass.280.3178
SMILESCC[C@H](c1ccccc1)c1c(O)c2ccccc2oc1=O