Reaction Details
TargetCytochrome P450 2C9
LigandBDBM50408941
Substrate/Competitorn/a
Meas. Tech.ChEMBL_51549 (CHEMBL661223)
Ki 3000±n/a nM
Citation Rao, SAoyama, RSchrag, MTrager, WFRettie, AJones, JP A refined 3-dimensional QSAR of cytochrome P450 2C9: computational predictions of drug interactions. J Med Chem43:2789-96 (2000) Cytochrome P450 2C9
Name:Cytochrome P450 2C9
Type:Enzyme
Mol. Mass.:55636.33
Organism:Homo sapiens (Human)
Description:P11712
Residue:490
BDBM50408941
NameBDBM50408941
Synonyms:CHEMBL2114283
TypeSmall organic molecule
Emp. Form.C19H18O4
Mol. Mass.310.3438
SMILESC[C@@H](O)C[C@H](c1ccccc1)c1c(O)c2ccccc2oc1=O