Reaction Details
TargetD(2) dopamine receptor
LigandBDBM50090754
Substrate/Competitorn/a
Meas. Tech.ChEMBL_61455 (CHEMBL670882)
Ki>1000±n/a nM
Citation Hammarberg, ENordvall, GLeideborg, RNylöf, MHanson, SJohansson, LThorberg, SOTolf, BRJerning, ESvantesson, GTMohell, NAhlgren, CWestlind-Danielsson, ACsöregh, IJohansson, R Synthesis of novel 5-substituted 3-amino-3,4-dihydro-2H-1-benzopyran derivatives and their interactions with the 5-HT1A receptor. J Med Chem43:2837-50 (2000) D(2) dopamine receptor
Name:D(2) dopamine receptor
Type:Cell-surface receptors
Mol. Mass.:50647.10
Organism:Homo sapiens (Human)
Description:P14416
Residue:443
BDBM50090754
NameBDBM50090754
Synonyms:(R)-3-Propylamino-chroman-5-carboxylic acid amide | CHEMBL97773
TypeSmall organic molecule
Emp. Form.C13H18N2O2
Mol. Mass.234.2942
SMILESCCCNC1COc2cccc(C(N)=O)c2C1