Reaction Details
Target5-hydroxytryptamine receptor 1A
LigandBDBM50090756
Substrate/Competitorn/a
Meas. Tech.ChEMBL_1206 (CHEMBL615972)
Ki 0.41±n/a nM
Citation Hammarberg, ENordvall, GLeideborg, RNylöf, MHanson, SJohansson, LThorberg, SOTolf, BRJerning, ESvantesson, GTMohell, NAhlgren, CWestlind-Danielsson, ACsöregh, IJohansson, R Synthesis of novel 5-substituted 3-amino-3,4-dihydro-2H-1-benzopyran derivatives and their interactions with the 5-HT1A receptor. J Med Chem43:2837-50 (2000) 5-hydroxytryptamine receptor 1A
Name:5-hydroxytryptamine receptor 1A
Type:G Protein-Coupled Receptor (GPCR)
Mol. Mass.:46445.29
Organism:Rattus norvegicus (rat)
Description:Binding assays were performed using rat hippocampal membranes.
Residue:422
BDBM50090756
NameBDBM50090756
Synonyms:(R)-3-(Cyclopentyl-propyl-amino)-chroman-5-carboxylic acid methyl ester | CHEMBL96999
TypeSmall organic molecule
Emp. Form.C19H27NO3
Mol. Mass.317.4226
SMILESCCCN(C1CCCC1)C1COc2cccc(C(=O)OC)c2C1