Reaction Details
Target5-hydroxytryptamine receptor 1A
LigandBDBM50090759
Substrate/Competitorn/a
Meas. Tech.ChEMBL_1207 (CHEMBL615973)
Ki 64±n/a nM
Citation Hammarberg, ENordvall, GLeideborg, RNylöf, MHanson, SJohansson, LThorberg, SOTolf, BRJerning, ESvantesson, GTMohell, NAhlgren, CWestlind-Danielsson, ACsöregh, IJohansson, R Synthesis of novel 5-substituted 3-amino-3,4-dihydro-2H-1-benzopyran derivatives and their interactions with the 5-HT1A receptor. J Med Chem43:2837-50 (2000) 5-hydroxytryptamine receptor 1A
Name:5-hydroxytryptamine receptor 1A
Type:G Protein-Coupled Receptor (GPCR)
Mol. Mass.:46445.29
Organism:Rattus norvegicus (rat)
Description:Binding assays were performed using rat hippocampal membranes.
Residue:422
BDBM50090759
NameBDBM50090759
Synonyms:(R)-3-Dipropylamino-chroman-5-carboxylic acid isopropylamide CHEMBL95688
TypeSmall organic molecule
Emp. Form.C19H30N2O2
Mol. Mass.318.4537
SMILESCCCN(CCC)C1COc2cccc(C(=O)NC(C)C)c2C1