Reaction Details
Target5-hydroxytryptamine receptor 1A
LigandBDBM50090770
Substrate/Competitorn/a
Meas. Tech.ChEMBL_1208 (CHEMBL615974)
Ki 3.1±n/a nM
Citation Hammarberg, ENordvall, GLeideborg, RNylöf, MHanson, SJohansson, LThorberg, SOTolf, BRJerning, ESvantesson, GTMohell, NAhlgren, CWestlind-Danielsson, ACsöregh, IJohansson, R Synthesis of novel 5-substituted 3-amino-3,4-dihydro-2H-1-benzopyran derivatives and their interactions with the 5-HT1A receptor. J Med Chem43:2837-50 (2000) 5-hydroxytryptamine receptor 1A
Name:5-hydroxytryptamine receptor 1A
Type:G Protein-Coupled Receptor (GPCR)
Mol. Mass.:46445.29
Organism:Rattus norvegicus (rat)
Description:Binding assays were performed using rat hippocampal membranes.
Residue:422
BDBM50090770
NameBDBM50090770
Synonyms:(R)-Isopropyl-(5-methoxy-chroman-3-yl)-propyl-amine CHEMBL99713
TypeSmall organic molecule
Emp. Form.C16H25NO2
Mol. Mass.263.3752
SMILESCCCN(C(C)C)C1COc2cccc(OC)c2C1