Reaction Details
TargetProstaglandin G/H synthase 2
LigandBDBM22952
Substrate/Competitorn/a
Meas. Tech.ChEMBL_43839 (CHEMBL658501)
IC50 250±n/a nM
Citation Kalgutkar, ASMarnett, ABCrews, BCRemmel, RPMarnett, LJ Ester and amide derivatives of the nonsteroidal antiinflammatory drug, indomethacin, as selective cyclooxygenase-2 inhibitors. J Med Chem43:2860-70 (2000) Prostaglandin G/H synthase 2
Name:Prostaglandin G/H synthase 2
Type:Enzyme
Mol. Mass.:69003.89
Organism:Homo sapiens (Human)
Description:Recombinant Cox-2 provided by Cayman (Cayman Chemical Co.,Ann Arbor, MI).
Residue:604
BDBM22952
NameBDBM22952
Synonyms:CHEMBL73572 methyl 2-{1-[(4-chlorophenyl)carbonyl]-5-methoxy-2-methyl-1H-indol-3-yl}acetate
TypeSmall organic molecule
Emp. Form.C20H18ClNO4
Mol. Mass.371.814
SMILESCOC(=O)Cc1c(C)n(C(=O)c2ccc(Cl)cc2)c2ccc(OC)cc12