Reaction Details
TargetAdenosine kinase
LigandBDBM50049820
Substrate/Competitorn/a
Meas. Tech.ChEMBL_31114 (CHEMBL642225)
IC50 470±n/a nM
Citation Ugarkar, BGDaRe, JMKopcho, JJBrowne, CESchanzer, JMWiesner, JBErion, MD Adenosine kinase inhibitors. 1. Synthesis, enzyme inhibition, and antiseizure activity of 5-iodotubercidin analogues. J Med Chem43:2883-93 (2000) Adenosine kinase
Name:Adenosine kinase
Type:PROTEIN
Mol. Mass.:40545.97
Organism:Homo sapiens (Human)
Description:ChEMBL_1467841
Residue:362
BDBM50049820
NameBDBM50049820
Synonyms:4-Amino-5-carboxamide-7-(D-ribofuranosyl)pyrrolo[2,3-d]pyrimidine 4-Amino-7-(3,4-dihydroxy-5-hydroxymethyl-tetrahydro-furan-2-yl)-7H-pyrrolo[2,3-d]pyrimidine-5-carboxylic acid amide CHEMBL101892 cid_5153
TypeSmall organic molecule
Emp. Form.C12H15N5O5
Mol. Mass.309.278
SMILESNC(=O)c1cn([C@@H]2O[C@H](CO)[C@@H](O)[C@H]2O)c2ncnc(N)c12