Reaction Details
TargetAdenosine kinase
LigandBDBM50090862
Substrate/Competitorn/a
Meas. Tech.ChEMBL_31114 (CHEMBL642225)
IC50 0.6±n/a nM
Citation Ugarkar, BGDaRe, JMKopcho, JJBrowne, CESchanzer, JMWiesner, JBErion, MD Adenosine kinase inhibitors. 1. Synthesis, enzyme inhibition, and antiseizure activity of 5-iodotubercidin analogues. J Med Chem43:2883-93 (2000) Adenosine kinase
Name:Adenosine kinase
Type:PROTEIN
Mol. Mass.:40545.97
Organism:Homo sapiens (Human)
Description:ChEMBL_1467841
Residue:362
BDBM50090862
NameBDBM50090862
Synonyms:(1R,5S)-2-((3R,4aR)-4-Amino-5-iodo-pyrrolo[2,3-d]pyrimidin-7-yl)-5-aminomethyl-tetrahydro-furan-3,4-diol 2-(4-Amino-5-iodo-pyrrolo[2,3-d]pyrimidin-7-yl)-5-aminomethyl-tetrahydro-furan-3,4-diol | CHEMBL322611
TypeSmall organic molecule
Emp. Form.C11H14IN5O3
Mol. Mass.391.165
SMILESNC[C@H]1O[C@H]([C@H](O)[C@@H]1O)n1cc(I)c2c(N)ncnc12