Reaction Details
TargetAdenosine kinase
LigandBDBM50090883
Substrate/Competitorn/a
Meas. Tech.ChEMBL_31116 (CHEMBL643544)
IC50 0.8±n/a nM
Citation Ugarkar, BGCastellino, AJDaRe, JMKopcho, JJWiesner, JBSchanzer, JMErion, MD Adenosine kinase inhibitors. 2. Synthesis, enzyme inhibition, and antiseizure activity of diaryltubercidin analogues. J Med Chem43:2894-905 (2000) Adenosine kinase
Name:Adenosine kinase
Type:PROTEIN
Mol. Mass.:40545.97
Organism:Homo sapiens (Human)
Description:ChEMBL_1467841
Residue:362
BDBM50090883
NameBDBM50090883
Synonyms:(1R,4S,5R)-2-Hydroxymethyl-5-(5-phenyl-4-phenylamino-pyrrolo[2,3-d]pyrimidin-7-yl)-tetrahydro-furan-3,4-diol CHEMBL319315
TypeSmall organic molecule
Emp. Form.C23H22N4O4
Mol. Mass.418.4452
SMILESOC[C@H]1O[C@H]([C@H](O)[C@@H]1O)n1cc(-c2ccccc2)c2c(Nc3ccccc3)ncnc12