Reaction Details
Target5-hydroxytryptamine receptor 2A
LigandBDBM50091079
Substrate/Competitorn/a
Meas. Tech.ChEMBL_2636 (CHEMBL618692)
Ki 4±n/a nM
Citation Dowd, CSHerrick-Davis, KEgan, CDuPre, ASmith, CTeitler, MGlennon, RA 1-[4-(3-Phenylalkyl)phenyl]-2-aminopropanes as 5-HT(2A) partial agonists. J Med Chem43:3074-84 (2000) 5-hydroxytryptamine receptor 2A
Name:5-hydroxytryptamine receptor 2A
Type:G Protein-Coupled Receptor (GPCR)
Mol. Mass.:52852.05
Organism:Rattus norvegicus (rat)
Description:Rat cortex membranes 5-HT2A receptors.
Residue:471
BDBM50091079
NameBDBM50091079
Synonyms:2-[3,5-Dimethoxy-4-(3-phenyl-propyl)-phenyl]-1-methyl-ethylamine | CHEMBL102268
TypeSmall organic molecule
Emp. Form.C20H27NO2
Mol. Mass.313.4339
SMILESCOc1cc(CC(C)N)cc(OC)c1CCCc1ccccc1