Reaction Details
Target5-hydroxytryptamine receptor 2A
LigandBDBM50091067
Substrate/Competitorn/a
Meas. Tech.ChEMBL_2636 (CHEMBL618692)
Ki 8±n/a nM
Citation Dowd, CSHerrick-Davis, KEgan, CDuPre, ASmith, CTeitler, MGlennon, RA 1-[4-(3-Phenylalkyl)phenyl]-2-aminopropanes as 5-HT(2A) partial agonists. J Med Chem43:3074-84 (2000) 5-hydroxytryptamine receptor 2A
Name:5-hydroxytryptamine receptor 2A
Type:G Protein-Coupled Receptor (GPCR)
Mol. Mass.:52852.05
Organism:Rattus norvegicus (rat)
Description:Rat cortex membranes 5-HT2A receptors.
Residue:471
BDBM50091067
NameBDBM50091067
Synonyms:2-[2-Methoxy-4-(3-phenyl-propyl)-phenyl]-1-methyl-ethylamine | CHEMBL105381
TypeSmall organic molecule
Emp. Form.C19H25NO
Mol. Mass.283.4079
SMILESCOc1cc(CCCc2ccccc2)ccc1CC(C)N