Reaction Details
TargetSodium-dependent dopamine transporter
LigandBDBM50091095
Substrate/Competitorn/a
Meas. Tech.ChEMBL_61667 (CHEMBL879871)
Ki 2651±n/a nM
Citation Wilson, AAGinovart, NSchmidt, MMeyer, JHThrelkeld, PGHoule, S Novel radiotracers for imaging the serotonin transporter by positron emission tomography: synthesis, radiosynthesis, and in vitro and ex vivo evaluation of (11)C-labeled 2-(phenylthio)araalkylamines. J Med Chem43:3103-10 (2000) Sodium-dependent dopamine transporter
Name:Sodium-dependent dopamine transporter
Type:Multi-pass membrane protein
Mol. Mass.:68497.11
Organism:Homo sapiens (Human)
Description:Q01959
Residue:620
BDBM50091095
NameBDBM50091095
Synonyms:2-(2-Dimethylaminomethyl-phenylsulfanyl)-5-methoxy-phenylamine | CHEMBL107077
TypeSmall organic molecule
Emp. Form.C16H20N2OS
Mol. Mass.288.408
SMILESCOc1ccc(Sc2ccccc2CN(C)C)c(N)c1