Reaction Details
TargetSodium-dependent dopamine transporter
LigandBDBM50091097
Substrate/Competitorn/a
Meas. Tech.ChEMBL_61667 (CHEMBL879871)
Ki 1423±n/a nM
Citation Wilson, AAGinovart, NSchmidt, MMeyer, JHThrelkeld, PGHoule, S Novel radiotracers for imaging the serotonin transporter by positron emission tomography: synthesis, radiosynthesis, and in vitro and ex vivo evaluation of (11)C-labeled 2-(phenylthio)araalkylamines. J Med Chem43:3103-10 (2000) Sodium-dependent dopamine transporter
Name:Sodium-dependent dopamine transporter
Type:Multi-pass membrane protein
Mol. Mass.:68497.11
Organism:Homo sapiens (Human)
Description:Q01959
Residue:620
BDBM50091097
NameBDBM50091097
Synonyms:3-Amino-4-(2-dimethylaminomethyl-phenylsulfanyl)-benzonitrile | CHEMBL106939
TypeSmall organic molecule
Emp. Form.C16H17N3S
Mol. Mass.283.391
SMILESCN(C)Cc1ccccc1Sc1ccc(cc1N)C#N