Reaction Details
TargetEndothelin-1 receptor
LigandBDBM50068674
Substrate/Competitorn/a
Meas. Tech.ChEMBL_65638 (CHEMBL681520)
Ki 4.7±n/a nM
Citation Murugesan, NGu, ZStein, PDSpergel, SMathur, ALeith, LLiu, ECZhang, RBird, EWaldron, TMarino, AMorrison, RAWebb, MLMoreland, SBarrish, JC Biphenylsulfonamide endothelin receptor antagonists. 2. Discovery of 4'-oxazolyl biphenylsulfonamides as a new class of potent, highly selective ET(A) antagonists. J Med Chem43:3111-7 (2000) Endothelin-1 receptor
Name:Endothelin-1 receptor
Type:Enzyme Catalytic Domain
Mol. Mass.:48736.88
Organism:Homo sapiens (Human)
Description:P25101
Residue:427
BDBM50068674
NameBDBM50068674
Synonyms:2'-Amino-4'-isobutyl-biphenyl-2-sulfonic acid (3,4-dimethyl-isoxazol-5-yl)-amide BMS-187308 | CHEMBL106684
TypeSmall organic molecule
Emp. Form.C21H25N3O3S
Mol. Mass.399.507
SMILESCC(C)Cc1ccc(c(N)c1)-c1ccccc1S(=O)(=O)Nc1onc(C)c1C