Reaction Details
TargetEndothelin-1 receptor
LigandBDBM50091104
Substrate/Competitorn/a
Meas. Tech.ChEMBL_65638 (CHEMBL681520)
Ki 0.2±n/a nM
Citation Murugesan, NGu, ZStein, PDSpergel, SMathur, ALeith, LLiu, ECZhang, RBird, EWaldron, TMarino, AMorrison, RAWebb, MLMoreland, SBarrish, JC Biphenylsulfonamide endothelin receptor antagonists. 2. Discovery of 4'-oxazolyl biphenylsulfonamides as a new class of potent, highly selective ET(A) antagonists. J Med Chem43:3111-7 (2000) Endothelin-1 receptor
Name:Endothelin-1 receptor
Type:Enzyme Catalytic Domain
Mol. Mass.:48736.88
Organism:Homo sapiens (Human)
Description:P25101
Residue:427
BDBM50091104
NameBDBM50091104
Synonyms:CHEMBL29422 | N-[2'-(3,4-Dimethyl-isoxazol-5-ylsulfamoyl)-4-oxazol-2-yl-biphenyl-2-ylmethyl]-acetamide
TypeSmall organic molecule
Emp. Form.C23H22N4O5S
Mol. Mass.466.51
SMILESCC(=O)NCc1cc(ccc1-c1ccccc1S(=O)(=O)Nc1onc(C)c1C)-c1ncco1