Reaction Details
TargetEndothelin-1 receptor
LigandBDBM50091108
Substrate/Competitorn/a
Meas. Tech.ChEMBL_65638 (CHEMBL681520)
Ki 2±n/a nM
Citation Murugesan, NGu, ZStein, PDSpergel, SMathur, ALeith, LLiu, ECZhang, RBird, EWaldron, TMarino, AMorrison, RAWebb, MLMoreland, SBarrish, JC Biphenylsulfonamide endothelin receptor antagonists. 2. Discovery of 4'-oxazolyl biphenylsulfonamides as a new class of potent, highly selective ET(A) antagonists. J Med Chem43:3111-7 (2000) Endothelin-1 receptor
Name:Endothelin-1 receptor
Type:Enzyme Catalytic Domain
Mol. Mass.:48736.88
Organism:Homo sapiens (Human)
Description:P25101
Residue:427
BDBM50091108
NameBDBM50091108
Synonyms:4'-(4-Methyl-oxazol-2-yl)-biphenyl-2-sulfonic acid (3,4-dimethyl-isoxazol-5-yl)-amide | CHEMBL104223
TypeSmall organic molecule
Emp. Form.C21H19N3O4S
Mol. Mass.409.458
SMILESCc1coc(n1)-c1ccc(cc1)-c1ccccc1S(=O)(=O)Nc1onc(C)c1C