Reaction Details
TargetAdenosine receptor A3
LigandBDBM50091137
Substrate/Competitorn/a
Meas. Tech.ChEMBL_32017 (CHEMBL649053)
Ki 2.9±n/a nM
Citation Colotta, VCatarzi, DVarano, FCecchi, LFilacchioni, GMartini, CTrincavelli, LLucacchini, A Synthesis and structure-activity relationships of a new set of 2-arylpyrazolo[3,4-c]quinoline derivatives as adenosine receptor antagonists. J Med Chem43:3118-24 (2000) Adenosine receptor A3
Name:Adenosine receptor A3
Type:G Protein-Coupled Receptor (GPCR)
Mol. Mass.:36197.32
Organism:Homo sapiens (Human)
Description:P0DMS8
Residue:318
BDBM50091137
NameBDBM50091137
Synonyms:2-(4-Chloro-phenyl)-2,5-dihydro-pyrazolo[3,4-c]quinolin-4-one | CHEMBL106740
TypeSmall organic molecule
Emp. Form.C16H10ClN3O
Mol. Mass.295.723
SMILESClc1ccc(cc1)-n1cc2c(n1)c(=O)[nH]c1ccccc21